Reaction Details
TargetMu-type opioid receptor
LigandBDBM50055073
Substrate/Competitorn/a
Meas. Tech.ChEMBL_1447930 (CHEMBL3379233)
Ki 3335±n/a nM
Citation Bourgeois, CWerfel, EGalla, FLehmkuhl, KTorres-Gómez, HSchepmann, DKögel, BChristoph, TStraßburger, WEnglberger, WSoeberdt, MHüwel, SGalla, HJWünsch, B Synthesis and pharmacological evaluation of 5-pyrrolidinylquinoxalines as a novel class of peripherally restricted¿-opioid receptor agonists. J Med Chem57:6845-60 (2014) 
 
Mu-type opioid receptor
Name:Mu-type opioid receptor
Type:G Protein-Coupled Receptor (GPCR)
Mol. Mass.:44789.51
Organism:Homo sapiens (Human)
Description:P35372
Residue:400
BDBM50055073
NameBDBM50055073
Synonyms:CHEMBL3323521
TypeSmall organic molecule
Emp. Form.C23H31Cl2N3O2
Mol. Mass.452.417
SMILESCCC(=O)N1CCN(C2C(CCCC12)N1CCCC1)C(=O)Cc1ccc(Cl)c(Cl)c1