Reaction Details
TargetMu-type opioid receptor
LigandBDBM50055080
Substrate/Competitorn/a
Meas. Tech.ChEMBL_1447930 (CHEMBL3379233)
Ki 6000±n/a nM
Citation Bourgeois, CWerfel, EGalla, FLehmkuhl, KTorres-Gómez, HSchepmann, DKögel, BChristoph, TStraßburger, WEnglberger, WSoeberdt, MHüwel, SGalla, HJWünsch, B Synthesis and pharmacological evaluation of 5-pyrrolidinylquinoxalines as a novel class of peripherally restricted¿-opioid receptor agonists. J Med Chem57:6845-60 (2014) 
 
Mu-type opioid receptor
Name:Mu-type opioid receptor
Type:G Protein-Coupled Receptor (GPCR)
Mol. Mass.:44789.51
Organism:Homo sapiens (Human)
Description:P35372
Residue:400
BDBM50055080
NameBDBM50055080
Synonyms:CHEMBL3323527
TypeSmall organic molecule
Emp. Form.C24H31Cl2N3O5
Mol. Mass.512.426
SMILESCOC(=O)CC(=O)N1CCN(C2C(CCCC12)N1CCC(O)C1)C(=O)Cc1ccc(Cl)c(Cl)c1