Reaction Details
TargetKappa-type opioid receptor
LigandBDBM50055067
Substrate/Competitorn/a
Meas. Tech.ChEMBL_1447940 (CHEMBL3379243)
EC50 26±n/a nM
Citation Bourgeois, CWerfel, EGalla, FLehmkuhl, KTorres-Gómez, HSchepmann, DKögel, BChristoph, TStraßburger, WEnglberger, WSoeberdt, MHüwel, SGalla, HJWünsch, B Synthesis and pharmacological evaluation of 5-pyrrolidinylquinoxalines as a novel class of peripherally restricted¿-opioid receptor agonists. J Med Chem57:6845-60 (2014) 
 
Kappa-type opioid receptor
Name:Kappa-type opioid receptor
Type:G Protein-Coupled Receptor (GPCR)
Mol. Mass.:42648.76
Organism:Homo sapiens (Human)
Description:P41145
Residue:380
BDBM50055067
NameBDBM50055067
Synonyms:CHEMBL3323514
TypeSmall organic molecule
Emp. Form.C28H35Cl2N3O2
Mol. Mass.516.502
SMILESCOc1ccc(CN2CCN(C3C(CCCC23)N2CCCC2)C(=O)Cc2ccc(Cl)c(Cl)c2)cc1