Reaction Details
TargetKappa-type opioid receptor
LigandBDBM50055072
Substrate/Competitorn/a
Meas. Tech.ChEMBL_1447940 (CHEMBL3379243)
EC50 330±n/a nM
Citation Bourgeois, CWerfel, EGalla, FLehmkuhl, KTorres-Gómez, HSchepmann, DKögel, BChristoph, TStraßburger, WEnglberger, WSoeberdt, MHüwel, SGalla, HJWünsch, B Synthesis and pharmacological evaluation of 5-pyrrolidinylquinoxalines as a novel class of peripherally restricted¿-opioid receptor agonists. J Med Chem57:6845-60 (2014) 
 
Kappa-type opioid receptor
Name:Kappa-type opioid receptor
Type:G Protein-Coupled Receptor (GPCR)
Mol. Mass.:42648.76
Organism:Homo sapiens (Human)
Description:P41145
Residue:380
BDBM50055072
NameBDBM50055072
Synonyms:CHEMBL3323520
TypeSmall organic molecule
Emp. Form.C22H29Cl2N3O2
Mol. Mass.438.391
SMILESCC(=O)N1CCN(C2C(CCCC12)N1CCCC1)C(=O)Cc1ccc(Cl)c(Cl)c1