Reaction Details
TargetBeta-2 adrenergic receptor
LigandBDBM50055253
Substrate/Competitorn/a
Meas. Tech.ChEMBL_1449717 (CHEMBL3378140)
IC50 12±n/a nM
Citation Arnold, NBeattie, DBradley, MBrearley, ABrown, LCharlton, SJFairhurst, RAFarr, DFozard, JFullerton, JGosling, MHatto, JJanus, DJones, DJordan, LLewis, CMaas, JMcCarthy, CMercer, MOakman, HPress, NProfit, RSchuerch, FSykes, DTaylor, RJTrifilieff, ATuffnell, A The identification of 7-[(R)-2-((1S,2S)-2-benzyloxycyclopentylamino)-1-hydroxyethyl]-4-hydroxybenzothiazolone as an inhaled long-actingß2-adrenoceptor agonist. Bioorg Med Chem Lett24:4341-7 (2014) 
 
Beta-2 adrenergic receptor
Name:Beta-2 adrenergic receptor
Type:Enzyme Catalytic Domain
Mol. Mass.:46993.24
Organism:GUINEA PIG
Description:adrenergic Beta2 ADRB2 GUINEA PIG::Q8K4Z4
Residue:418
BDBM50055253
NameBDBM50055253
Synonyms:CHEMBL3323659
TypeSmall organic molecule
Emp. Form.C20H22N2O3S
Mol. Mass.370.465
SMILESO[C@@H](CN[C@@H]1CCC[C@@H]1c1ccccc1)c1ccc(O)c2[nH]c(=O)sc12