Reaction Details
TargetBeta-2 adrenergic receptor
LigandBDBM50318159
Substrate/Competitorn/a
Meas. Tech.ChEMBL_1450448 (CHEMBL3379944)
EC50 1.5±n/a nM
Citation Arnold, NBeattie, DBradley, MBrearley, ABrown, LCharlton, SJFairhurst, RAFarr, DFozard, JFullerton, JGosling, MHatto, JJanus, DJones, DJordan, LLewis, CMaas, JMcCarthy, CMercer, MOakman, HPress, NProfit, RSchuerch, FSykes, DTaylor, RJTrifilieff, ATuffnell, A The identification of 7-[(R)-2-((1S,2S)-2-benzyloxycyclopentylamino)-1-hydroxyethyl]-4-hydroxybenzothiazolone as an inhaled long-actingß2-adrenoceptor agonist. Bioorg Med Chem Lett24:4341-7 (2014) 
 
Beta-2 adrenergic receptor
Name:Beta-2 adrenergic receptor
Type:n/a
Mol. Mass.:46461.69
Organism:Homo sapiens (Human)
Description:P07550
Residue:413
BDBM50318159
NameBDBM50318159
Synonyms:8-Hydroxy-5-[(R)-1-hydroxy-2-(5,6-diethylindan-2-ylamino)-ethyl]-1H-quinolin-2-one INDACATEROL
TypeSmall organic molecule
Emp. Form.C24H28N2O3
Mol. Mass.392.4907
SMILESCCc1cc2CC(Cc2cc1CC)NC[C@H](O)c1ccc(O)c2[nH]c(=O)ccc12