Reaction Details
TargetCannabinoid receptor 2
LigandBDBM50055439
Substrate/Competitorn/a
Meas. Tech.ChEMBL_1450470 (CHEMBL3379966)
Ki 1520±n/a nM
Citation Brizzi, AAiello, FMarini, PCascio, MGCorelli, FBrizzi, VDe Petrocellis, LLigresti, ALuongo, LLamponi, SMaione, SPertwee, RGDi Marzo, V Structure-affinity relationships and pharmacological characterization of new alkyl-resorcinol cannabinoid receptor ligands: Identification of a dual cannabinoid receptor/TRPA1 channel agonist. Bioorg Med Chem22:4770-83 (2014) 
 
Cannabinoid receptor 2
Name:Cannabinoid receptor 2
Type:G Protein-Coupled Receptor (GPCR)
Mol. Mass.:39690.94
Organism:Homo sapiens (Human)
Description:P34972
Residue:360
BDBM50055439
NameBDBM50055439
Synonyms:CHEMBL3323698
TypeSmall organic molecule
Emp. Form.C23H41NO3
Mol. Mass.379.5765
SMILESCCCCCc1cc(O)cc(OCCCCCCCCCN[C@H](C)CO)c1