Reaction Details
TargetCannabinoid receptor 2
LigandBDBM50055432
Substrate/Competitorn/a
Meas. Tech.ChEMBL_1450470 (CHEMBL3379966)
Ki 183±n/a nM
Citation Brizzi, AAiello, FMarini, PCascio, MGCorelli, FBrizzi, VDe Petrocellis, LLigresti, ALuongo, LLamponi, SMaione, SPertwee, RGDi Marzo, V Structure-affinity relationships and pharmacological characterization of new alkyl-resorcinol cannabinoid receptor ligands: Identification of a dual cannabinoid receptor/TRPA1 channel agonist. Bioorg Med Chem22:4770-83 (2014) 
 
Cannabinoid receptor 2
Name:Cannabinoid receptor 2
Type:G Protein-Coupled Receptor (GPCR)
Mol. Mass.:39690.94
Organism:Homo sapiens (Human)
Description:P34972
Residue:360
BDBM50055432
NameBDBM50055432
Synonyms:CHEMBL3323692
TypeSmall organic molecule
Emp. Form.C24H42N2O3
Mol. Mass.406.6019
SMILESCCCCCc1cc(O)cc(OCCCCCCCCCCC(=O)NN(C)C)c1