Reaction Details
TargetCannabinoid receptor 2
LigandBDBM50055461
Substrate/Competitorn/a
Meas. Tech.ChEMBL_1450470 (CHEMBL3379966)
Ki 50±n/a nM
Citation Brizzi, AAiello, FMarini, PCascio, MGCorelli, FBrizzi, VDe Petrocellis, LLigresti, ALuongo, LLamponi, SMaione, SPertwee, RGDi Marzo, V Structure-affinity relationships and pharmacological characterization of new alkyl-resorcinol cannabinoid receptor ligands: Identification of a dual cannabinoid receptor/TRPA1 channel agonist. Bioorg Med Chem22:4770-83 (2014) 
 
Cannabinoid receptor 2
Name:Cannabinoid receptor 2
Type:G Protein-Coupled Receptor (GPCR)
Mol. Mass.:39690.94
Organism:Homo sapiens (Human)
Description:P34972
Residue:360
BDBM50055461
NameBDBM50055461
Synonyms:CHEMBL3323674
TypeSmall organic molecule
Emp. Form.C26H45NO4
Mol. Mass.435.6398
SMILESCCCCCCC(C)(C)c1cc(O)cc(OCCCCCCCC(=O)N[C@H](C)CO)c1