Reaction Details
TargetCannabinoid receptor 1
LigandBDBM50055448
Substrate/Competitorn/a
Meas. Tech.ChEMBL_1450469 (CHEMBL3379965)
Ki>10000±n/a nM
Citation Brizzi, AAiello, FMarini, PCascio, MGCorelli, FBrizzi, VDe Petrocellis, LLigresti, ALuongo, LLamponi, SMaione, SPertwee, RGDi Marzo, V Structure-affinity relationships and pharmacological characterization of new alkyl-resorcinol cannabinoid receptor ligands: Identification of a dual cannabinoid receptor/TRPA1 channel agonist. Bioorg Med Chem22:4770-83 (2014) 
 
Cannabinoid receptor 1
Name:Cannabinoid receptor 1
Type:G Protein-Coupled Receptor (GPCR)
Mol. Mass.:52868.96
Organism:Homo sapiens (Human)
Description:P21554
Residue:472
BDBM50055448
NameBDBM50055448
Synonyms:CHEMBL3323688
TypeSmall organic molecule
Emp. Form.C33H53NO3
Mol. Mass.511.7788
SMILESCCCCCCC(C)(C)c1cc(O)cc(OCCCCCCCC(=O)NC23CC4CC(CC(C4)C2)C3)c1