Reaction Details
TargetMonocarboxylate transporter 1
LigandBDBM22000
Substrate/Competitorn/a
Meas. Tech.ChEMBL_1451367 (CHEMBL3363651)
IC50 105±n/a nM
Citation Wang, HYang, CDoherty, JRRoush, WRCleveland, JLBannister, TD Synthesis and structure-activity relationships of pteridine dione and trione monocarboxylate transporter 1 inhibitors. J Med Chem57:7317-24 (2014) 
 
Monocarboxylate transporter 1
Name:Monocarboxylate transporter 1
Type:PROTEIN
Mol. Mass.:53956.64
Organism:Homo sapiens (Human)
Description:ChEMBL_1451367
Residue:500
BDBM22000
NameBDBM22000
Synonyms:7-[(3-hydroxypropyl)sulfanyl]-2-methyl-4-(2-methylpropyl)-6-(naphthalen-1-ylmethyl)-1H,2H,6H-pyrrolo[3,4-d]pyridazin-1-one Pyrrolo[3,4-d]pyridazin-1-one, 2
Typen/a
Emp. Form.C25H29N3O2S
Mol. Mass.435.582
SMILESCC(C)Cc1nn(C)c(=O)c2c(SCCCO)n(Cc3cccc4ccccc34)cc12