Reaction Details
TargetHistone deacetylase 1
LigandBDBM50055513
Substrate/Competitorn/a
Meas. Tech.ChEMBL_1452233 (CHEMBL3366145)
IC50 0.210000±n/a nM
Citation Kim, BPark, HSalvador, LASerrano, PEKwan, JCZeller, SLChen, QYRyu, SLiu, YByeon, SLuesch, HHong, J Evaluation of class I HDAC isoform selectivity of largazole analogues. Bioorg Med Chem Lett24:3728-31 (2014) 
 
Histone deacetylase 1
Name:Histone deacetylase 1
Type:Enzyme
Mol. Mass.:55090.27
Organism:Homo sapiens (Human)
Description:Q13547
Residue:482
BDBM50055513
NameBDBM50055513
Synonyms:CHEMBL3317811
TypeSmall organic molecule
Emp. Form.C25H28N4O5S3
Mol. Mass.560.709
SMILESC[C@@]12CSC(=N1)c1csc(CNC(=O)C[C@H](OC(=O)[C@H](Cc3ccc(O)cc3)NC2=O)\C=C\CCS)n1