Reaction Details
TargetD(2) dopamine receptor
LigandBDBM50055521
Substrate/Competitorn/a
Meas. Tech.ChEMBL_1452244 (CHEMBL3366156)
Ki 2.9±n/a nM
Citation Sampson, DBricker, BZhu, XYPeprah, KLamango, NSSetola, VRoth, BLAblordeppey, SY Further evaluation of the tropane analogs of haloperidol. Bioorg Med Chem Lett24:4294-7 (2014) 
 
D(2) dopamine receptor
Name:D(2) dopamine receptor
Type:Cell-surface receptors
Mol. Mass.:50647.10
Organism:Homo sapiens (Human)
Description:P14416
Residue:443
BDBM50055521
NameBDBM50055521
Synonyms:CHEMBL3321790
TypeSmall organic molecule
Emp. Form.C22H25ClFNOS
Mol. Mass.405.956
SMILESOC1(CC2CCC(C1)N2CCCSc1ccc(F)cc1)c1ccc(Cl)cc1