Reaction Details
TargetD(3) dopamine receptor
LigandBDBM50185473
Substrate/Competitorn/a
Meas. Tech.ChEMBL_1452245 (CHEMBL3366157)
Ki 0.710000±n/a nM
Citation Sampson, DBricker, BZhu, XYPeprah, KLamango, NSSetola, VRoth, BLAblordeppey, SY Further evaluation of the tropane analogs of haloperidol. Bioorg Med Chem Lett24:4294-7 (2014) 
 
D(3) dopamine receptor
Name:D(3) dopamine receptor
Type:n/a
Mol. Mass.:44243.43
Organism:Homo sapiens (Human)
Description:n/a
Residue:400
BDBM50185473
NameBDBM50185473
Synonyms:4-(3-(4-chlorophenyl)-3-hydroxy-8-aza-bicyclo[3.2.1]octan-8-yl)-1-(4-fluorophenyl)butan-1-one 4-[3-(4-Chlorophenyl)-3-hydroxy-8-azabicyclo[3.2.1]oct-8-yl]-1-(4-fluorophenyl)butan-1-one | CHEMBL210578
TypeSmall organic molecule
Emp. Form.C23H25ClFNO2
Mol. Mass.401.902
SMILESOC1(CC2CCC(C1)N2CCCC(=O)c1ccc(F)cc1)c1ccc(Cl)cc1