Reaction Details
TargetD(4) dopamine receptor
LigandBDBM50362866
Substrate/Competitorn/a
Meas. Tech.ChEMBL_1452246 (CHEMBL3366158)
Ki 1.5±n/a nM
Citation Sampson, DBricker, BZhu, XYPeprah, KLamango, NSSetola, VRoth, BLAblordeppey, SY Further evaluation of the tropane analogs of haloperidol. Bioorg Med Chem Lett24:4294-7 (2014) 
 
D(4) dopamine receptor
Name:D(4) dopamine receptor
Type:Enzyme Catalytic Domain
Mol. Mass.:41307.65
Organism:RAT
Description:DOPAMINE D4.4 0 RAT::P30729
Residue:387
BDBM50362866
NameBDBM50362866
Synonyms:CHEMBL1940402
TypeSmall organic molecule
Emp. Form.C21H25ClFNO
Mol. Mass.361.881
SMILESOC1(CCN(CCCCc2ccc(F)cc2)CC1)c1ccc(Cl)cc1