Reaction Details
TargetSphingosine 1-phosphate receptor 1
LigandBDBM50055549
Substrate/Competitorn/a
Meas. Tech.ChEMBL_1452260 (CHEMBL3366172)
EC50 148±n/a nM
Citation Tian, YJin, JWang, XHu, JXiao, QZhou, WChen, XYin, D Discovery of oxazole and triazole derivatives as potent and selective S1P(1) agonists through pharmacophore-guided design. Eur J Med Chem85:1-15 (2014) 
 
Sphingosine 1-phosphate receptor 1
Name:Sphingosine 1-phosphate receptor 1
Type:Enzyme
Mol. Mass.:42836.02
Organism:Homo sapiens (Human)
Description:P21453
Residue:382
BDBM50055549
NameBDBM50055549
Synonyms:CHEMBL3341926
TypeSmall organic molecule
Emp. Form.C21H22N3O6P
Mol. Mass.443.3896
SMILESNC(CO)(CCc1ccc(cc1)-c1coc(n1)-c1ccc(cc1)C#N)COP(O)(O)=O