Reaction Details
TargetSphingosine 1-phosphate receptor 3
LigandBDBM50055538
Substrate/Competitorn/a
Meas. Tech.ChEMBL_1452261 (CHEMBL3366173)
EC50 4689±n/a nM
Citation Tian, YJin, JWang, XHu, JXiao, QZhou, WChen, XYin, D Discovery of oxazole and triazole derivatives as potent and selective S1P(1) agonists through pharmacophore-guided design. Eur J Med Chem85:1-15 (2014) 
 
Sphingosine 1-phosphate receptor 3
Name:Sphingosine 1-phosphate receptor 3
Type:G Protein-Coupled Receptor (GPCR)
Mol. Mass.:42278.13
Organism:Homo sapiens (Human)
Description:Q99500
Residue:378
BDBM50055538
NameBDBM50055538
Synonyms:CHEMBL3342010
TypeSmall organic molecule
Emp. Form.C22H29N4O5P
Mol. Mass.460.4632
SMILESCCCc1ccc(cc1)-n1cc(nn1)-c1ccc(CCC(N)(CO)COP(O)(O)=O)cc1