Reaction Details
TargetSphingosine 1-phosphate receptor 3
LigandBDBM50055535
Substrate/Competitorn/a
Meas. Tech.ChEMBL_1452261 (CHEMBL3366173)
EC50>5000±n/a nM
Citation Tian, YJin, JWang, XHu, JXiao, QZhou, WChen, XYin, D Discovery of oxazole and triazole derivatives as potent and selective S1P(1) agonists through pharmacophore-guided design. Eur J Med Chem85:1-15 (2014) 
 
Sphingosine 1-phosphate receptor 3
Name:Sphingosine 1-phosphate receptor 3
Type:G Protein-Coupled Receptor (GPCR)
Mol. Mass.:42278.13
Organism:Homo sapiens (Human)
Description:Q99500
Residue:378
BDBM50055535
NameBDBM50055535
Synonyms:CHEMBL3342013
TypeSmall organic molecule
Emp. Form.C20H24FN4O5P
Mol. Mass.450.4005
SMILESNC(CO)(CCc1ccc(cc1)-c1cn(Cc2ccc(F)cc2)nn1)COP(O)(O)=O