Reaction Details
TargetCannabinoid receptor 2
LigandBDBM50055571
Substrate/Competitorn/a
Meas. Tech.ChEMBL_1453155 (CHEMBL3364789)
Ki 17±n/a nM
Citation Rosati, OMessina, FPelosi, ACurini, MPetrucci, VGertsch, JChicca, A One-pot heterogeneous synthesis of¿(3)-tetrahydrocannabinol analogues and xanthenes showing differential binding to CB(1) and CB(2) receptors. Eur J Med Chem85:77-86 (2014) 
 
Cannabinoid receptor 2
Name:Cannabinoid receptor 2
Type:G Protein-Coupled Receptor (GPCR)
Mol. Mass.:39690.94
Organism:Homo sapiens (Human)
Description:P34972
Residue:360
BDBM50055571
NameBDBM50055571
Synonyms:CHEMBL3329945
TypeSmall organic molecule
Emp. Form.C21H30O2
Mol. Mass.314.4617
SMILESCCCCCc1cc(O)c2C3=C(CC[C@H](C)C3)C(C)(C)Oc2c1