Reaction Details
TargetCannabinoid receptor 2
LigandBDBM50055564
Substrate/Competitorn/a
Meas. Tech.ChEMBL_1453156 (CHEMBL3364790)
EC50 820±n/a nM
Citation Rosati, OMessina, FPelosi, ACurini, MPetrucci, VGertsch, JChicca, A One-pot heterogeneous synthesis of¿(3)-tetrahydrocannabinol analogues and xanthenes showing differential binding to CB(1) and CB(2) receptors. Eur J Med Chem85:77-86 (2014) 
 
Cannabinoid receptor 2
Name:Cannabinoid receptor 2
Type:G Protein-Coupled Receptor (GPCR)
Mol. Mass.:39690.94
Organism:Homo sapiens (Human)
Description:P34972
Residue:360
BDBM50055564
NameBDBM50055564
Synonyms:CHEMBL3329480
TypeSmall organic molecule
Emp. Form.C21H30O2
Mol. Mass.314.4617
SMILESCCCCCc1cc(O)c2c(OC3=C(CC[C@H](C)C3)C2(C)C)c1