Reaction Details
TargetP2Y purinoceptor 12
LigandBDBM50100269
Substrate/Competitorn/a
Meas. Tech.ChEMBL_1454020 (CHEMBL3367079)
IC50 4600±n/a nM
Citation Boldron, CBesse, ABordes, MFTissandié, SYvon, XGau, BBadorc, ARousseaux, TBarré, GMeneyrol, JZech, GNazare, MFossey, VPflieger, AMBonnet-Lignon, SMillet, LBriot, CDol, FHérault, JPSavi, PLassalle, GDelesque, NHerbert, JMBono, F N-[6-(4-butanoyl-5-methyl-1H-pyrazol-1-yl)pyridazin-3-yl]-5-chloro-1-[2-(4-methylpiperazin-1-yl)-2-oxoethyl]-1H-indole-3-carboxamide (SAR216471), a novel intravenous and oral, reversible, and directly acting P2Y12 antagonist. J Med Chem57:7293-316 (2014) 
 
P2Y purinoceptor 12
Name:P2Y purinoceptor 12
Type:PROTEIN
Mol. Mass.:39068.50
Organism:Rattus norvegicus
Description:ChEMBL_1454020
Residue:343
BDBM50100269
NameBDBM50100269
Synonyms:CHEMBL3325627
TypeSmall organic molecule
Emp. Form.C27H28N4O4
Mol. Mass.472.5356
SMILESCCCC(=O)c1cnn(c1C)-c1ccc(NC(=O)c2cn(CC(O)=O)c3cc(C)c(C)cc23)cc1