Reaction Details
TargetP2Y purinoceptor 12
LigandBDBM50055845
Substrate/Competitorn/a
Meas. Tech.ChEMBL_1454020 (CHEMBL3367079)
IC50 1200±n/a nM
Citation Boldron, CBesse, ABordes, MFTissandié, SYvon, XGau, BBadorc, ARousseaux, TBarré, GMeneyrol, JZech, GNazare, MFossey, VPflieger, AMBonnet-Lignon, SMillet, LBriot, CDol, FHérault, JPSavi, PLassalle, GDelesque, NHerbert, JMBono, F N-[6-(4-butanoyl-5-methyl-1H-pyrazol-1-yl)pyridazin-3-yl]-5-chloro-1-[2-(4-methylpiperazin-1-yl)-2-oxoethyl]-1H-indole-3-carboxamide (SAR216471), a novel intravenous and oral, reversible, and directly acting P2Y12 antagonist. J Med Chem57:7293-316 (2014) 
 
P2Y purinoceptor 12
Name:P2Y purinoceptor 12
Type:PROTEIN
Mol. Mass.:39068.50
Organism:Rattus norvegicus
Description:ChEMBL_1454020
Residue:343
BDBM50055845
NameBDBM50055845
Synonyms:CHEMBL3325787
TypeSmall organic molecule
Emp. Form.C32H36N6O3
Mol. Mass.552.6666
SMILES[H][C@]12CN(C(=O)Cn3cc(C(=O)Nc4ccc(cc4)-n4ncc(C(=O)CCC)c4C)c4cc(C)ccc34)[C@]([H])(CN1C)C2