Reaction Details
TargetPoly [ADP-ribose] polymerase 1
LigandBDBM50055886
Substrate/Competitorn/a
Meas. Tech.ChEMBL_1458598 (CHEMBL3371141)
IC50 86±n/a nM
Citation Wang, LXZhou, XBXiao, MLJiang, NLiu, FZhou, WXWang, XKZheng, ZBLi, S Synthesis and biological evaluation of substituted 4-(thiophen-2-ylmethyl)-2H-phthalazin-1-ones as potent PARP-1 inhibitors. Bioorg Med Chem Lett24:3739-43 (2014) 
 
Poly [ADP-ribose] polymerase 1
Name:Poly [ADP-ribose] polymerase 1
Type:n/a
Mol. Mass.:113114.22
Organism:Homo sapiens (Human)
Description:P09874
Residue:1014
BDBM50055886
NameBDBM50055886
Synonyms:CHEMBL3317906
TypeSmall organic molecule
Emp. Form.C26H21N5O3S
Mol. Mass.483.542
SMILESO=C(N1CCN(CC1)C(=O)c1ccc(cc1)C#N)c1csc(Cc2n[nH]c(=O)c3ccccc23)c1