Reaction Details
TargetCathepsin D
LigandBDBM50055930
Substrate/Competitorn/a
Meas. Tech.ChEMBL_1458603 (CHEMBL3371146)
IC50 81±n/a nM
Citation Grädler, UCzodrowski, PTsaklakidis, CKlein, MWerkmann, DLindemann, SMaskos, KLeuthner, B Structure-based optimization of non-peptidic Cathepsin D inhibitors. Bioorg Med Chem Lett24:4141-50 (2014) 
 
Cathepsin D
Name:Cathepsin D
Type:Enzyme
Mol. Mass.:44551.72
Organism:Homo sapiens (Human)
Description:Human proCathepsin D (SwissProt accession number P07339) was expressed in Sf9 cells, purified, and autoactivated.
Residue:412
BDBM50055930
NameBDBM50055930
Synonyms:CHEMBL3321934 | US9884814, Compound 276
TypeSmall organic molecule
Emp. Form.C28H35FN8O4
Mol. Mass.566.6271
SMILESCOc1ccc(CC(=O)NC(=N)N[C@H](CC2CCCCC2)C(=O)NCc2ccc(-c3nnn[nH]3)c(F)c2)cc1OC