Reaction Details
TargetMicrotubule-associated protein tau
LigandBDBM50055937
Substrate/Competitorn/a
Meas. Tech.ChEMBL_1459450 (CHEMBL3368556)
IC50<3000±n/a nM
Citation Fuse, SMatsumura, KFujita, YSugimoto, HTakahashi, T Development of dual targeting inhibitors against aggregations of amyloid-ß and tau protein. Eur J Med Chem85:228-34 (2014) 
 
Microtubule-associated protein tau
Name:Microtubule-associated protein tau
Type:Protein
Mol. Mass.:78928.63
Organism:Homo sapiens (Human)
Description:P10636
Residue:758
BDBM50055937
NameBDBM50055937
Synonyms:CHEBI:87637 | CHEMBL3330735
TypeSmall organic molecule
Emp. Form.C14H14ClN3S
Mol. Mass.291.799
SMILES[Cl-].CN(C)c1ccc2nc3ccc(N)cc3[s+]c2c1