Reaction Details
TargetSerine/threonine-protein kinase pim-3
LigandBDBM50055958
Substrate/Competitorn/a
Meas. Tech.ChEMBL_1460270 (CHEMBL3370186)
IC50 20±n/a nM
Citation Suchaud, VGavara, LGiraud, FNauton, LThéry, VAnizon, FMoreau, P Synthesis of pyrazolo[4,3-a]phenanthridines, a new scaffold for Pim kinase inhibition. Bioorg Med Chem22:4704-10 (2014) 
 
Serine/threonine-protein kinase pim-3
Name:Serine/threonine-protein kinase pim-3
Type:Protein
Mol. Mass.:35888.19
Organism:Homo sapiens (Human)
Description:Q86V86
Residue:326
BDBM50055958
NameBDBM50055958
Synonyms:CHEMBL3326555
TypeSmall organic molecule
Emp. Form.C14H8N4O2
Mol. Mass.264.2389
SMILES[O-][N+](=O)c1cc2[nH]ncc2c2c1ncc1ccccc21