Reaction Details
TargetMu-type opioid receptor
LigandBDBM50055967
Substrate/Competitorn/a
Meas. Tech.ChEMBL_1460276 (CHEMBL3370192)
IC50 730±n/a nM
Citation Cheng, MFOu, LCChen, SCChang, WTLaw, PYLoh, HHChao, YSShih, CYeh, SHUeng, SH Discovery, structure-activity relationship studies, and anti-nociceptive effects of 1-phenyl-3,6,6-trimethyl-1,5,6,7-tetrahydro-4H-indazol-4-one as novel opioid receptor agonists. Bioorg Med Chem22:4694-703 (2014) 
 
Mu-type opioid receptor
Name:Mu-type opioid receptor
Type:G Protein-Coupled Receptor (GPCR)
Mol. Mass.:44789.51
Organism:Homo sapiens (Human)
Description:P35372
Residue:400
BDBM50055967
NameBDBM50055967
Synonyms:CHEMBL3325714
TypeSmall organic molecule
Emp. Form.C16H16Br2N2O
Mol. Mass.412.119
SMILESCc1nn(c2CC(C)(C)CC(=O)c12)-c1ccc(Br)cc1Br