Reaction Details
TargetMu-type opioid receptor
LigandBDBM50055964
Substrate/Competitorn/a
Meas. Tech.ChEMBL_1460274 (CHEMBL3370190)
EC50 100±n/a nM
Citation Cheng, MFOu, LCChen, SCChang, WTLaw, PYLoh, HHChao, YSShih, CYeh, SHUeng, SH Discovery, structure-activity relationship studies, and anti-nociceptive effects of 1-phenyl-3,6,6-trimethyl-1,5,6,7-tetrahydro-4H-indazol-4-one as novel opioid receptor agonists. Bioorg Med Chem22:4694-703 (2014) 
 
Mu-type opioid receptor
Name:Mu-type opioid receptor
Type:G Protein-Coupled Receptor (GPCR)
Mol. Mass.:44789.51
Organism:Homo sapiens (Human)
Description:P35372
Residue:400
BDBM50055964
NameBDBM50055964
Synonyms:CHEMBL3325841
TypeSmall organic molecule
Emp. Form.C16H18Br2N2O
Mol. Mass.414.135
SMILESCc1nn(c2CC(C)(C)CC(O)c12)-c1ccc(Br)cc1Br