Reaction Details
TargetMu-type opioid receptor
LigandBDBM50055969
Substrate/Competitorn/a
Meas. Tech.ChEMBL_1460274 (CHEMBL3370190)
EC50 370±n/a nM
Citation Cheng, MFOu, LCChen, SCChang, WTLaw, PYLoh, HHChao, YSShih, CYeh, SHUeng, SH Discovery, structure-activity relationship studies, and anti-nociceptive effects of 1-phenyl-3,6,6-trimethyl-1,5,6,7-tetrahydro-4H-indazol-4-one as novel opioid receptor agonists. Bioorg Med Chem22:4694-703 (2014) 
 
Mu-type opioid receptor
Name:Mu-type opioid receptor
Type:G Protein-Coupled Receptor (GPCR)
Mol. Mass.:44789.51
Organism:Homo sapiens (Human)
Description:P35372
Residue:400
BDBM50055969
NameBDBM50055969
Synonyms:CHEMBL3325719
TypeSmall organic molecule
Emp. Form.C18H18Cl2N2O
Mol. Mass.349.254
SMILESCC1(C)Cc2c(c(nn2-c2ccc(Cl)cc2Cl)C2CC2)C(=O)C1