Reaction Details
TargetMu-type opioid receptor
LigandBDBM50055985
Substrate/Competitorn/a
Meas. Tech.ChEMBL_1460274 (CHEMBL3370190)
EC50 18400±n/a nM
Citation Cheng, MFOu, LCChen, SCChang, WTLaw, PYLoh, HHChao, YSShih, CYeh, SHUeng, SH Discovery, structure-activity relationship studies, and anti-nociceptive effects of 1-phenyl-3,6,6-trimethyl-1,5,6,7-tetrahydro-4H-indazol-4-one as novel opioid receptor agonists. Bioorg Med Chem22:4694-703 (2014) 
 
Mu-type opioid receptor
Name:Mu-type opioid receptor
Type:G Protein-Coupled Receptor (GPCR)
Mol. Mass.:44789.51
Organism:Homo sapiens (Human)
Description:P35372
Residue:400
BDBM50055985
NameBDBM50055985
Synonyms:CHEMBL3325704
TypeSmall organic molecule
Emp. Form.C17H20N2O2
Mol. Mass.284.3529
SMILESCOc1ccc(cc1)-n1nc(C)c2c1CC(C)(C)CC2=O