Reaction Details
TargetKappa-type opioid receptor
LigandBDBM50055966
Substrate/Competitorn/a
Meas. Tech.ChEMBL_1460278 (CHEMBL3370194)
IC50 570±n/a nM
Citation Cheng, MFOu, LCChen, SCChang, WTLaw, PYLoh, HHChao, YSShih, CYeh, SHUeng, SH Discovery, structure-activity relationship studies, and anti-nociceptive effects of 1-phenyl-3,6,6-trimethyl-1,5,6,7-tetrahydro-4H-indazol-4-one as novel opioid receptor agonists. Bioorg Med Chem22:4694-703 (2014) 
 
Kappa-type opioid receptor
Name:Kappa-type opioid receptor
Type:G Protein-Coupled Receptor (GPCR)
Mol. Mass.:42648.76
Organism:Homo sapiens (Human)
Description:P41145
Residue:380
BDBM50055966
NameBDBM50055966
Synonyms:CHEMBL3325715
TypeSmall organic molecule
Emp. Form.C16H16BrClN2O
Mol. Mass.367.668
SMILESCc1nn(c2CC(C)(C)CC(=O)c12)-c1ccc(Cl)cc1Br