Reaction Details
TargetPeptidyl-prolyl cis-trans isomerase NIMA-interacting 1
LigandBDBM50056212
Substrate/Competitorn/a
Meas. Tech.ChEMBL_1449741 (CHEMBL3378164)
Ki 1900±n/a nM
Citation Guo, CHou, XDong, LMarakovits, JGreasley, SDagostino, EFerre, RJohnson, MCHumphries, PSLi, HPaderes, GDPiraino, JKraynov, EMurray, BW Structure-based design of novel human Pin1 inhibitors (III): optimizing affinity beyond the phosphate recognition pocket. Bioorg Med Chem Lett24:4187-91 (2014) 
 
Peptidyl-prolyl cis-trans isomerase NIMA-interacting 1
Name:Peptidyl-prolyl cis-trans isomerase NIMA-interacting 1
Type:PROTEIN
Mol. Mass.:18248.11
Organism:Homo sapiens (Human)
Description:ChEMBL_1502595
Residue:163
BDBM50056212
NameBDBM50056212
Synonyms:CHEMBL3322224
TypeSmall organic molecule
Emp. Form.C22H18N2O3
Mol. Mass.358.3899
SMILESOC(=O)C(Cc1cc2ccccc2[nH]1)NC(=O)c1ccc2ccccc2c1