Reaction Details
TargetPeptidyl-prolyl cis-trans isomerase NIMA-interacting 1
LigandBDBM50056219
Substrate/Competitorn/a
Meas. Tech.ChEMBL_1449741 (CHEMBL3378164)
Ki 196±n/a nM
Citation Guo, CHou, XDong, LMarakovits, JGreasley, SDagostino, EFerre, RJohnson, MCHumphries, PSLi, HPaderes, GDPiraino, JKraynov, EMurray, BW Structure-based design of novel human Pin1 inhibitors (III): optimizing affinity beyond the phosphate recognition pocket. Bioorg Med Chem Lett24:4187-91 (2014) 
 
Peptidyl-prolyl cis-trans isomerase NIMA-interacting 1
Name:Peptidyl-prolyl cis-trans isomerase NIMA-interacting 1
Type:PROTEIN
Mol. Mass.:18248.11
Organism:Homo sapiens (Human)
Description:ChEMBL_1502595
Residue:163
BDBM50056219
NameBDBM50056219
Synonyms:CHEMBL3322230
TypeSmall organic molecule
Emp. Form.C21H17Cl2FN2O2S
Mol. Mass.451.341
SMILESOC(=O)C1(Cc2cc3ccc(F)cc3[nH]2)CSC(CCc2c(Cl)cccc2Cl)=N1