Reaction Details
TargetGlycogen phosphorylase, muscle form
LigandBDBM50056222
Substrate/Competitorn/a
Meas. Tech.ChEMBL_1449751 (CHEMBL3378174)
Ki 1000000±n/a nM
Citation Parmenopoulou, VKantsadi, ALTsirkone, VGChatzileontiadou, DSManta, SZographos, SEMolfeta, CArchontis, GAgius, LHayes, JMLeonidas, DDKomiotis, D Structure based inhibitor design targeting glycogen phosphorylase B. Virtual screening, synthesis, biochemical and biological assessment of novel N-acyl-ß-d-glucopyranosylamines. Bioorg Med Chem22:4810-25 (2014) 
 
Glycogen phosphorylase, muscle form
Name:Glycogen phosphorylase, muscle form
Type:PROTEIN
Mol. Mass.:97097.45
Organism:Homo sapiens (Human)
Description:ChEMBL_1449751
Residue:842
BDBM50056222
NameBDBM50056222
Synonyms:CHEMBL3322298
TypeSmall organic molecule
Emp. Form.C42H72O36
Mol. Mass.1152.9995
SMILES[H][C@]1(O[C@H]2[C@H](O)[C@@H](O)[C@@]([H])(O[C@H]3[C@H](O)[C@@H](O)[C@@]([H])(O[C@H]4[C@H](O)[C@@H](O)[C@@]([H])(O[C@H]5[C@H](O)[C@@H](O)[C@@]([H])(O[C@H]6[C@H](O)[C@@H](O)[C@@]([H])(O[C@H]7[C@H](O)[C@@H](O)C(O)O[C@@H]7CO)O[C@@H]6CO)O[C@@H]5CO)O[C@@H]4CO)O[C@@H]3CO)O[C@@H]2CO)O[C@H](CO)[C@@H](O)[C@H](O)[C@H]1O