Reaction Details
TargetGlycogen phosphorylase, muscle form
LigandBDBM50056224
Substrate/Competitorn/a
Meas. Tech.ChEMBL_1449753 (CHEMBL3378176)
Ki 1800±n/a nM
Citation Parmenopoulou, VKantsadi, ALTsirkone, VGChatzileontiadou, DSManta, SZographos, SEMolfeta, CArchontis, GAgius, LHayes, JMLeonidas, DDKomiotis, D Structure based inhibitor design targeting glycogen phosphorylase B. Virtual screening, synthesis, biochemical and biological assessment of novel N-acyl-ß-d-glucopyranosylamines. Bioorg Med Chem22:4810-25 (2014) 
 
Glycogen phosphorylase, muscle form
Name:Glycogen phosphorylase, muscle form
Type:Enzyme
Mol. Mass.:97296.32
Organism:Oryctolagus cuniculus (rabbit)
Description:Phosphorylation of Ser-15 converts phosphorylase B (unphosphorylated) to phosphorylase A.
Residue:843
BDBM50056224
NameBDBM50056224
Synonyms:CHEMBL3322302
TypeSmall organic molecule
Emp. Form.C15H17F3N2O7
Mol. Mass.394.2999
SMILESOC[C@H]1O[C@@H](NC(=O)NC(=O)c2ccc(cc2)C(F)(F)F)[C@H](O)[C@@H](O)[C@@H]1O