Reaction Details
TargetGlycogen phosphorylase, muscle form
LigandBDBM50056291
Substrate/Competitorn/a
Meas. Tech.ChEMBL_1449753 (CHEMBL3378176)
Ki 3500±n/a nM
Citation Parmenopoulou, VKantsadi, ALTsirkone, VGChatzileontiadou, DSManta, SZographos, SEMolfeta, CArchontis, GAgius, LHayes, JMLeonidas, DDKomiotis, D Structure based inhibitor design targeting glycogen phosphorylase B. Virtual screening, synthesis, biochemical and biological assessment of novel N-acyl-ß-d-glucopyranosylamines. Bioorg Med Chem22:4810-25 (2014) 
 
Glycogen phosphorylase, muscle form
Name:Glycogen phosphorylase, muscle form
Type:Enzyme
Mol. Mass.:97296.32
Organism:Oryctolagus cuniculus (rabbit)
Description:Phosphorylation of Ser-15 converts phosphorylase B (unphosphorylated) to phosphorylase A.
Residue:843
BDBM50056291
NameBDBM50056291
Synonyms:CHEMBL3322299
TypeSmall organic molecule
Emp. Form.C19H21NO6
Mol. Mass.359.3731
SMILESOC[C@H]1O[C@@H](NC(=O)\C=C\c2ccc3ccccc3c2)[C@H](O)[C@@H](O)[C@@H]1O