Reaction Details
TargetNeuraminidase
LigandBDBM7462
Substrate/Competitorn/a
Meas. Tech.ChEMBL_1449777 (CHEMBL3378764)
IC50 42200±n/a nM
Citation Rakers, CSchwerdtfeger, SMMortier, JDuwe, SWolff, TWolber, GMelzig, MF Inhibitory potency of flavonoid derivatives on influenza virus neuraminidase. Bioorg Med Chem Lett24:4312-7 (2014) 
 
Neuraminidase
Name:Neuraminidase
Type:PROTEIN
Mol. Mass.:51863.92
Organism:Influenza A virus (strain A/USSR/90/1977 H1N1)
Description:ChEMBL_109720
Residue:470
BDBM7462
NameBDBM7462
Synonyms:3,5,7-trihydroxy-2-(4-hydroxyphenyl)-4H-chromen-4-one CHEMBL150 Kaempferol (Kmp) kaempferol
TypeSmall organic molecule
Emp. Form.C15H10O6
Mol. Mass.286.2363
SMILESOc1ccc(cc1)-c1oc2cc(O)cc(O)c2c(=O)c1O