Reaction Details
TargetCannabinoid receptor 1
LigandBDBM50056339
Substrate/Competitorn/a
Meas. Tech.ChEMBL_1449782 (CHEMBL3378769)
EC50 123±n/a nM
Citation Huang, GPemp, DStadtmüller, PNimczick, MHeilmann, JDecker, M Design, synthesis and in vitro evaluation of novel uni- and bivalent ligands for the cannabinoid receptor type 1 with variation of spacer length and structure. Bioorg Med Chem Lett24:4209-14 (2014) 
 
Cannabinoid receptor 1
Name:Cannabinoid receptor 1
Type:G Protein-Coupled Receptor (GPCR)
Mol. Mass.:52868.96
Organism:Homo sapiens (Human)
Description:P21554
Residue:472
BDBM50056339
NameBDBM50056339
Synonyms:CHEMBL3322476
TypeSmall organic molecule
Emp. Form.C32H35Cl3N4O
Mol. Mass.598.006
SMILESCc1c(nn(c1-c1ccc(Cl)cc1)-c1ccc(Cl)cc1Cl)C(=O)NCCCCCCCCNCc1ccccc1