Reaction Details
TargetCytochrome P450 3A4
LigandBDBM50056354
Substrate/Competitorn/a
Meas. Tech.ChEMBL_1451406 (CHEMBL3363966)
IC50 2800±n/a nM
Citation Voight, EAGomtsyan, ARDaanen, JFPerner, RJSchmidt, RGBayburt, EKDiDomenico, SMcDonald, HAPuttfarcken, PSChen, JNeelands, TRBianchi, BRHan, PReilly, RMFranklin, PHSegreti, JANelson, RASu, ZKing, AJPolakowski, JSBaker, SJGauvin, DMLewis, LRMikusa, JPJoshi, SKFaltynek, CRKym, PRKort, ME Discovery of (R)-1-(7-chloro-2,2-bis(fluoromethyl)chroman-4-yl)-3-(3-methylisoquinolin-5-yl)urea (A-1165442): a temperature-neutral transient receptor potential vanilloid-1 (TRPV1) antagonist with analgesic efficacy. J Med Chem57:7412-24 (2014) 
 
Cytochrome P450 3A4
Name:Cytochrome P450 3A4
Type:Enzyme
Mol. Mass.:57349.57
Organism:Homo sapiens (Human)
Description:n/a
Residue:503
BDBM50056354
NameBDBM50056354
Synonyms:CHEMBL3326577
TypeSmall organic molecule
Emp. Form.C23H24FN3O2
Mol. Mass.393.454
SMILESCCC1(CC)C[C@@H](NC(=O)Nc2cccc3cnccc23)c2cc(F)ccc2O1