Reaction Details
TargetTransient receptor potential cation channel subfamily V member 1
LigandBDBM50056435
Substrate/Competitorn/a
Meas. Tech.ChEMBL_1451403 (CHEMBL3363963)
IC50 7.0±n/a nM
Citation Voight, EAGomtsyan, ARDaanen, JFPerner, RJSchmidt, RGBayburt, EKDiDomenico, SMcDonald, HAPuttfarcken, PSChen, JNeelands, TRBianchi, BRHan, PReilly, RMFranklin, PHSegreti, JANelson, RASu, ZKing, AJPolakowski, JSBaker, SJGauvin, DMLewis, LRMikusa, JPJoshi, SKFaltynek, CRKym, PRKort, ME Discovery of (R)-1-(7-chloro-2,2-bis(fluoromethyl)chroman-4-yl)-3-(3-methylisoquinolin-5-yl)urea (A-1165442): a temperature-neutral transient receptor potential vanilloid-1 (TRPV1) antagonist with analgesic efficacy. J Med Chem57:7412-24 (2014) 
 
Transient receptor potential cation channel subfamily V member 1
Name:Transient receptor potential cation channel subfamily V member 1
Type:Protein
Mol. Mass.:94960.75
Organism:Homo sapiens (Human)
Description:Q8NER1
Residue:839
BDBM50056435
NameBDBM50056435
Synonyms:CHEMBL3326574
TypeSmall organic molecule
Emp. Form.C22H25FN2O3
Mol. Mass.384.4439
SMILESCC1(C)C[C@@H](NC(=O)Nc2cccc3CC[C@H](O)Cc23)c2ccc(F)cc2O1