Reaction Details
TargetSimilar to alpha-tubulin isoform 1
LigandBDBM50005480
Substrate/Competitorn/a
Meas. Tech.ChEMBL_1454104 (CHEMBL3362589)
IC50 1800±n/a nM
Citation Duan, YTSang, YLMakawana, JATeraiya, SBYao, YFTang, DJTao, XXZhu, HL Discovery and molecular modeling of novel 1-indolyl acetate--5-nitroimidazole targeting tubulin polymerization as antiproliferative agents. Eur J Med Chem85:341-51 (2014) 
 
Similar to alpha-tubulin isoform 1
Name:Similar to alpha-tubulin isoform 1
Synonyms:Similar to alpha-tubulin isoform 1
Type:PROTEIN
Mol. Mass.:10383.05
Organism:Bos taurus
Description:ChEMBL_104716
Residue:99
BDBM50005480
NameBDBM50005480
TypeSmall organic molecule
Emp. Form.C18H20O5
Mol. Mass.316.3484
SMILESCOc1ccc(\C=C/c2cc(OC)c(OC)c(OC)c2)cc1O