Reaction Details
Target2'-deoxynucleoside 5'-phosphate N-hydrolase 1
LigandBDBM50056960
Substrate/Competitorn/a
Meas. Tech.ChEMBL_1455848 (CHEMBL3362302)
Ki 1700±n/a nM
Citation Amiable, CPaoletti, JHaouz, APadilla, ALabesse, GKaminski, PAPochet, S 6-(Hetero)Arylpurine nucleotides as inhibitors of the oncogenic target DNPH1: synthesis, structural studies and cytotoxic activities. Eur J Med Chem85:418-37 (2014) 
 
2'-deoxynucleoside 5'-phosphate N-hydrolase 1
Name:2'-deoxynucleoside 5'-phosphate N-hydrolase 1
Type:Enzyme
Mol. Mass.:17775.23
Organism:Rattus norvegicus (Rat)
Description:O35820
Residue:163
BDBM50056960
NameBDBM50056960
Synonyms:CHEMBL3331372
TypeSmall organic molecule
Emp. Form.C20H22N5O10P
Mol. Mass.523.3899
SMILESO[C@@H]1[C@@H](COP(O)(O)=O)O[C@H]([C@@H]1O)n1cnc2c(ncnc12)-c1ccc(NC(=O)CCC(O)=O)cc1