Reaction Details
TargetXanthine dehydrogenase/oxidase
LigandBDBM50057015
Substrate/Competitorn/a
Meas. Tech.ChEMBL_1458649 (CHEMBL3367443)
IC50 5.5±n/a nM
Citation Guan, QCheng, ZMa, XWang, LFeng, DCui, YBao, KWu, LZhang, W Synthesis and bioevaluation of 2-phenyl-4-methyl-1,3-selenazole-5-carboxylic acids as potent xanthine oxidase inhibitors. Eur J Med Chem85:508-16 (2014) 
 
Xanthine dehydrogenase/oxidase
Name:Xanthine dehydrogenase/oxidase
Type:Protein
Mol. Mass.:146809.00
Organism:Bos taurus (Bovine)
Description:P80457
Residue:1332
BDBM50057015
NameBDBM50057015
Synonyms:CHEMBL3331617
TypeSmall organic molecule
Emp. Form.C15H12N2O3Se
Mol. Mass.347.23
SMILESCc1nc([se]c1C(O)=O)-c1ccc(OCC=C)c(c1)C#N