Reaction Details
TargetM-phase inducer phosphatase 2
LigandBDBM50057665
Substrate/Competitorn/a
Meas. Tech.ChEMBL_1448895 (CHEMBL3375097)
IC50 8320±n/a nM
Citation Li, YYu, YJin, KGao, LLuo, TSheng, LShao, XLi, J Synthesis and biological evaluation of novel thiadiazole amides as potent Cdc25B and PTP1B inhibitors. Bioorg Med Chem Lett24:4125-8 (2014) 
 
M-phase inducer phosphatase 2
Name:M-phase inducer phosphatase 2
Type:Protein
Mol. Mass.:64985.27
Organism:Homo sapiens (Human)
Description:n/a
Residue:580
BDBM50057665
NameBDBM50057665
Synonyms:CHEMBL3322848
TypeSmall organic molecule
Emp. Form.C22H15N5O7S
Mol. Mass.493.449
SMILESCOc1cccc(c1)C(=O)Nc1nnc(s1)-c1ccc(Oc2ccc(cc2[N+]([O-])=O)[N+]([O-])=O)cc1