Reaction Details
TargetPhosphomannomutase 2
LigandBDBM34336
Substrate/Competitorn/a
Meas. Tech.ChEMBL_1448920 (CHEMBL3375687)
IC50 9900±n/a nM
Citation Bravo, YTeriete, PDhanya, RPDahl, RLee, PSKiffer-Moreira, TGanji, SRSergienko, ESmith, LHFarquharson, CMillán, JLCosford, ND Design, synthesis and evaluation of benzoisothiazolones as selective inhibitors of PHOSPHO1. Bioorg Med Chem Lett24:4308-11 (2014) 
 
Phosphomannomutase 2
Name:Phosphomannomutase 2
Type:Enzyme Catalytic Domain
Mol. Mass.:28082.33
Organism:Homo sapiens (Human)
Description:gi_4557839
Residue:246
BDBM34336
NameBDBM34336
Synonyms:2-(2-morpholin-4-yl-5-morpholin-4-ylsulfonyl-phenyl)-1,2-benzothiazol-3-one 2-(2-morpholino-5-morpholinosulfonyl-phenyl)-1,2-benzothiazol-3-one MLS000055722 cid_2325815
TypeSmall organic molecule
Emp. Form.C21H23N3O5S2
Mol. Mass.461.554
SMILESO=c1n(sc2ccccc12)-c1cc(ccc1N1CCOCC1)S(=O)(=O)N1CCOCC1