Reaction Details
TargetcAMP-specific 3',5'-cyclic phosphodiesterase 4D
LigandBDBM50057795
Substrate/Competitorn/a
Meas. Tech.ChEMBL_1450581 (CHEMBL3372159)
IC50 210±n/a nM
Citation Brullo, CMassa, MRocca, MRotolo, CGuariento, SRivera, DRicciarelli, RFedele, EFossa, PBruno, O Synthesis, biological evaluation, and molecular modeling of new 3-(cyclopentyloxy)-4-methoxybenzaldehyde O-(2-(2,6-dimethylmorpholino)-2-oxoethyl) Oxime (GEBR-7b) related phosphodiesterase 4D (PDE4D) inhibitors. J Med Chem57:7061-72 (2014) 
 
cAMP-specific 3',5'-cyclic phosphodiesterase 4D
Name:cAMP-specific 3',5'-cyclic phosphodiesterase 4D
Type:Protein
Mol. Mass.:91092.69
Organism:Homo sapiens (Human)
Description:Q08499
Residue:809
BDBM50057795
NameBDBM50057795
Synonyms:CHEMBL3326090
TypeSmall organic molecule
Emp. Form.C22H35N3O5
Mol. Mass.421.5304
SMILESCOc1ccc(\C=N\OCC(O)CNN2CC(C)OC(C)C2)cc1OC1CCCC1