Reaction Details
TargetThromboxane A2 receptor
LigandBDBM50058026
Substrate/Competitorn/a
Meas. Tech.ChEMBL_1451468 (CHEMBL3364317)
IC50 54±n/a nM
Citation Ballatore, CGay, BHuang, LRobinson, KHJames, MJTrojanowski, JQLee, VMBrunden, KRSmith, AB Evaluation of the cyclopentane-1,2-dione as a potential bio-isostere of the carboxylic acid functional group. Bioorg Med Chem Lett24:4171-5 (2014) 
 
Thromboxane A2 receptor
Name:Thromboxane A2 receptor
Type:Enyzme
Mol. Mass.:37445.28
Organism:Homo sapiens (Human)
Description:P21731
Residue:343
BDBM50058026
NameBDBM50058026
Synonyms:CHEMBL3326602
TypeSmall organic molecule
Emp. Form.C20H20ClNO4S
Mol. Mass.405.895
SMILESOC1=C(Cc2cccc(CCNS(=O)(=O)c3ccc(Cl)cc3)c2)CCC1=O