Reaction Details
TargetTelomerase reverse transcriptase
LigandBDBM50058035
Substrate/Competitorn/a
Meas. Tech.ChEMBL_1451486 (CHEMBL3364665)
IC50 70±n/a nM
Citation Ilyinsky, NSShchyolkina, AKBorisova, OFMamaeva, OKZvereva, MIAzhibek, DMLivshits, MAMitkevich, VABalzarini, JSinkevich, YBLuzikov, YNDezhenkova, LGKolotova, ESShtil, AAShchekotikhin, AEKaluzhny, DN Novel multi-targeting anthra[2,3-b]thiophene-5,10-diones with guanidine-containing side chains: interaction with telomeric G-quadruplex, inhibition of telomerase and topoisomerase I and cytotoxic properties. Eur J Med Chem85:605-14 (2014) 
 
Telomerase reverse transcriptase
Name:Telomerase reverse transcriptase
Type:PROTEIN
Mol. Mass.:127099.03
Organism:Homo sapiens (Human)
Description:ChEMBL_1447029
Residue:1132
BDBM50058035
NameBDBM50058035
Synonyms:CHEMBL3330789
TypeSmall organic molecule
Emp. Form.C22H25ClN6O2S
Mol. Mass.472.991
SMILESCl.NCCCNc1c2C(=O)c3ccccc3C(=O)c2c(NCCNC(N)=N)c2ccsc12