Reaction Details
Target5-hydroxytryptamine receptor 7
LigandBDBM50058321
Substrate/Competitorn/a
Meas. Tech.ChEMBL_1456828 (CHEMBL3367561)
Ki 1.7±n/a nM
Citation Salerno, LPittalą, VModica, MNSiracusa, MAIntagliata, SCagnotto, ASalmona, MKurczab, RBojarski, AJRomeo, G Structure-activity relationships and molecular modeling studies of novel arylpiperazinylalkyl 2-benzoxazolones and 2-benzothiazolones as 5-HT(7) and 5-HT(1A) receptor ligands. Eur J Med Chem85:716-26 (2014) 
 
5-hydroxytryptamine receptor 7
Name:5-hydroxytryptamine receptor 7
Type:G Protein-Coupled Receptor (GPCR)
Mol. Mass.:53573.08
Organism:Homo sapiens (Human)
Description:P34969
Residue:479
BDBM50058321
NameBDBM50058321
Synonyms:CHEMBL3331261
TypeSmall organic molecule
Emp. Form.C21H24ClN3OS
Mol. Mass.401.953
SMILESClc1cccc(c1)N1CCN(CCCCn2c3ccccc3sc2=O)CC1