Reaction Details
TargetCarbonic anhydrase 2
LigandBDBM4703
Substrate/Competitorn/a
Meas. Tech.ChEMBL_1456833 (CHEMBL3367566)
Ki 46±n/a nM
Citation Prete, SDVullo, DOsman, SMScozzafava, AAlOthman, ZCapasso, CSupuran, CT Sulfonamide inhibition study of the carbonic anhydrases from the bacterial pathogen Porphyromonas gingivalis: theß-class (PgiCAb) versus the¿-class (PgiCA) enzymes. Bioorg Med Chem22:4537-43 (2014) 
 
Carbonic anhydrase 2
Name:Carbonic anhydrase 2
Type:Enzyme
Mol. Mass.:29250.71
Organism:Homo sapiens (Human)
Description:P00918
Residue:260
BDBM4703
NameBDBM4703
Synonyms:4-carboxybenzenesulfonamide 1 Benzoic Acid deriv. 31 JMC522226 Compound 22 JMC52646 Compound 23 | aromatic/heteroaromatic sulfonamide 23
TypeSmall organic molecule
Emp. Form.C7H7NO4S
Mol. Mass.201.2
SMILESNS(=O)(=O)c1ccc(cc1)C(O)=O